{"text_format":"1","workbook":"xlsx","n_sheets":7,"sheets":["Instructions","Cost Estimate Summary","Cost Estimate Tracking V2","Assumptions Tracking","Inflation Summary & Upload","Inflation Tables","Sliding Scales"],"not_rendered":{"charts":3,"images":5,"macros":1,"external_links":3,"defined_names":18,"comments":2,"pivot_tables":0},"unopened":[],"bounds":{"document_bytes":16777216,"sheet_cells":100000,"rows_first":2000,"rows_last":500,"rows_between":2000,"halvings":0,"cell_chars":16384,"cell_head_chars":4096},"cells_cut":0,"cells_raw":0,"read":"whole","date_system":"1900"}

{"sheet":"Instructions","index":0,"n_rows":20,"n_cols":3,"rows_kept":20,"cut":false,"hidden":false,"merged":[[15,1,15,20],[9,1,9,18]]}
[]
[null,"Instructions"]
[]
[1,"The Cost Estimate Summary tab serves as the data entry tab for the workbook."]
[2,null,"When entering data, please note that green cells require input."]
[3,null,"Grey cells do not require input"]
[4,"Ensure input where required. If no value then enter \"0\""]
[5,"Complete the general information portion at the top of the sheet."]
[6,"Drop down lists are provided for County/City/State, tier level and stage of development."]
[7,"Preliminary Engineering Phase costs include all expenses charged by the design staff (VDOT or Consultant) of each discipline through the advertisement of the project. Any of the support during the CN phase would be included in the CEI estimate."]
[8,"When using discipline only contingencies, Source, Defined, Allowances, Risk Type, and Contingencies should be entered in order for the total column to be calculated."]
[9,"When a complete phase contingency is selected and discipline contingencies are both selected an error message will appear."]
[10,"Discipline costs that span project development phases are to be shown in the phase that the time is charged. It can be captured in a discipline or in oversight, depending on what is appropriate."]
[11,"Right of Way & Utilities Phase costs include all expenses for right of way acquisition and utility relocations."]
[12,"Construction Phase costs include all expenses incurred from award to construction completion."]
[13,"Defined values, Allowances and Contingencies should be entered for each of the applicable disciplines.  Refer to the contingencies shown in Chapter 5 of the Cost Estimating manual for assistance determining the correct contingency percentage. The contingencies provided in the sliding scales are provided as a cross check.  They are intended to supplement and aid the estimator's engineering and human judgment."]
[14,"Major assumptions in Defined numbers and selection of contingency percentage needs to be documented in the \"Assumptions\" column."]
[15,"Application estimates should use their submitted schedule"]
[16,"Once all applicable fields have been entered and you are comfortable with the output, select the blue button corresponding to your current project milestone to transfer your estimate to the Cost Estimate Tracking tab"]
[17,"A feature has been added on the \"Inflation Summary & Upload\" sheet that enables the transer of CEWB estimate data to your PCES Workbook."]

{"sheet":"Cost Estimate Summary","index":1,"n_rows":256,"n_cols":21,"rows_kept":256,"cut":false,"hidden":false,"merged":[[91,4,91,6],[96,1,96,3],[96,4,96,6],[30,1,30,2],[37,1,37,2],[39,1,39,6],[92,1,92,2],[93,1,93,2],[94,1,94,2],[40,1,42,1],[75,1,77,1],[65,1,65,2],[81,6,82,6],[92,4,92,5],[95,4,95,5],[91,1,91,3],[1,1,1,7],[2,2,2,3],[3,2,3,3],[9,3,9,7],[9,1,9,2],[8,1,8,2],[7,1,7,7],[8,4,8,7],[5,3,5,4],[4,2,4,3],[44,4,44,7],[24,1,24,4],[93,4,93,5],[94,4,94,5],[81,7,82,7],[81,1,82,4],[90,1,90,7],[26,1,28,1],[29,1,29,7],[30,4,30,7],[43,1,43,7],[69,1,69,2],[67,1,67,4],[38,1,38,4],[64,3,64,4],[60,3,60,4]]}
[]
[null,"SYIP PROJECTS\nDETAILED PROJECT COST ESTIMATE SUMMARY\n(Version 2.2: 7/7/2023)",null,null,null,null,null,null,null,"Green Cells require input.  Allowance / Contingency are not necessarily required. All others are auto calculating.  Estimate to be entered based on current dollars and inflation will be applied at the bottom of this workbook for informational purposes only."]
[null,"Portal ID:",null,null,null,"Project UPC:",null,null,null,null,null,null,null,null,null,"Select Phase Risk Type Here (when using different contingency values for each discipline)",null,null,null,null,"Select Phase Risk Type Here (when using one phase contingency value)"]
[null,"Prepared By:",null,null,null,"Milestone","Select",null,null,null,null,null,null,null,null,"Type 1 Percentage",null,"$",null,null,"Type 1 Percentage"]
[null,"Reviewed By:",null,null,null,null,null,null,null,null,null,null,null,null,null,"Type 2 Deterministic",null,"%",null,null,"Type 2 Deterministic"]
[null,"Project Location:","Locality Type","Locality Name",null,"Tier Level","Select"]
[null,"Project Complexity Classification","Select Project Classification",null,null,null,null,null,null,null,null,null,null,null,null,null,null,null,null,null,"Select"]
[null,null,null,null,null,null,null,null,null,null,null,null,null,null,null,null,null,null,null,null,"Type 1 Percentage"]
[null,"Preliminary Engineering Phase ",null,7,"Do not enter a negative value for defined or allowance; Ensure input where required. If no value then enter \"0\" ",null,null,null,null,null,null,null,null,null,null,"Select",null,null,null,null,"Type 2 Deterministic"]
[null,"Project Estimate Component",null,null,null,null,null,null,null,null,null,null,null,null,null,"Percentage"]
[null,"Discipline","Source","Defined($)","Allowance*","Risk Type","Contingency  %           (Value of Risk)","Total",null,"Assumptions",null,null,null,null,null,"Lump Sum"]
[null,"Project Management","Select",null,null,null,null,{"$f":"IF(C12=\"Select\",0,(D12+E12))","v":0}]
[null,"Roadway","Select",null,null,null,null,{"$f":"IF(C13=\"Select\",0,(D13+E13))","v":0}]
[null,"Hydraulics","Select",null,null,null,null,0]
[null,"Utilities","Select",null,null,null,null,0,null,null,null,null,null,null,null,"CEI Environmental Inspection\n(Enter %)"]
[null,"Traffic","Select",null,null,null,null,0,null,null,null,null,null,null,null,"CEI VDOT or Locality\n(Enter %)"]
[null,"Structures/Bridges","Select",null,null,null,null,0,null,null,null,null,null,null,null,"CEI Oversight Costs\n(Enter %)"]
[null,"Materials/Geotech","Select",null,null,null,null,0]
[null,"Survey/SUE/Quality Level A SUE","Select",null,null,null,null,0]
[null,"Environmental","Select",null,null,null,null,0,null,null,null,null,null,null,null,"CEI Environmental Inspection\n(Enter Lump Sum)"]
[null,"Right of Way","Select",null,null,null,null,0,null,null,null,null,null,null,null,"CEI VDOT or Locality\n(Enter Lump Sum)"]
[null,"Other","Select",null,null,null,null,0,null,null,null,null,null,null,null,"CEI Oversight Costs\n(Enter Lump Sum)"]
[null,"VDOT PE Oversight on Local Assistance Projects","Total entered from LAD Spreadsheet",null,null,null,null,"Input Req'd"]
[null,null,"SUBTOTAL PE PHASE ESTIMATE                                                 (Without Contingency)",{"$f":"SUM(D12:D22)","v":0},{"$f":"SUM(E12:E22)","v":0},"Select Phase Risk Type Below",{"$f":"IF(F25=\"Type 1 Percentage\",\"Contingency  %                       (Value of Risk)\",IF(F25=\"Type 2 Deterministic\",\"Contingency  $                       (Value of Risk)\",\"Contingency\"))","v":"Contingency"}]
[null,"Phase Risk Type and Contingency (Value of Risk):                                                                                                                                                                                                                                                                                                                                                                                                              For Type 1 enter % amount;  For Type 2 enter $ amount",null,null,null,"Select",null,{"$f":"IF(F25=\"type 1 Percentage\",(D24+E24)*((G25/100)),IF(F25=\"type 2 Deterministic\",G25,0))","v":0},null,null,null,null,null,null,null,"CEI Environmental Inspection"]
[null,null,null,null,null,null,"TOTAL PE PHASE ESTIMATE",{"$f":"IF(F25=\"Select\",SUM(H12:H23),SUM(H12:H23,H25))","v":0},null,null,null,null,null,null,null,"CEI VDOT or Locality"]
[null,"Phase dates (XX/XX/XXXX)","PE Base Estimate Date",null,null,null,null,null,null,null,null,null,null,null,null,"CEI Oversight Costs"]
[null,null,"Start Date"]
[null,null,"End Date"]
[]
{"$rows_left_out":227}
{"sheet":"Cost Estimate Tracking V2","index":2,"n_rows":73,"n_cols":30,"rows_kept":73,"cut":false,"hidden":false,"merged":[[70,4,70,6],[19,2,19,3],[18,2,18,3],[17,2,17,3],[29,2,29,3],[49,2,49,3],[26,29,32,29],[27,2,27,3],[66,2,68,2],[37,2,37,3],[34,2,34,3],[35,2,35,3],[26,2,26,3],[28,2,28,3],[48,2,48,3],[50,2,50,3],[59,2,59,3],[36,5,36,6],[52,4,52,5],[56,4,56,5],[2,29,3,29],[3,1,3,3],[2,24,2,28],[2,9,2,13],[2,14,2,18],[3,9,3,13],[3,14,3,18],[3,19,3,23],[2,19,2,23],[3,24,3,28],[2,4,2,8],[7,29,19,29],[22,15,23,16],[34,5,35,6],[57,2,57,3],[2,1,2,3],[26,1,32,1],[38,2,47,2],[33,2,33,3],[36,1,65,1],[7,1,20,1],[6,2,6,3],[25,2,25,3],[8,2,8,3],[9,2,9,3],[7,2,7,3],[5,2,5,3],[70,9,70,11],[70,14,70,16],[70,19,70,21],[10,2,10,3],[11,2,11,3],[22,20,23,21],[22,5,23,6],[22,2,22,3],[33,6,33,7],[12,2,12,3],[13,2,13,3],[14,2,14,3],[23,2,23,3],[15,2,15,3],[21,2,21,3],[16,2,16,3]]}
[]
[null,null,null,null,null,null,"SYIP PROJECTS\nProject Cost Estimate Tracking V2.1","UPC:",null,null,null,"SYIP PROJECTS\nProject Cost Estimate Tracking V2.1","UPC:",null,null,null,"SYIP PROJECTS\nProject Cost Estimate Tracking V2.1","UPC:",null,null,null,"SYIP PROJECTS\nProject Cost Estimate Tracking V2.1","UPC:",null,null,null,"SYIP PROJECTS\nProject Cost Estimate Tracking V2","UPC:"]
[null,"Milestone",null,null,"Creation/Pre Scope",null,null,null,null,"Final Scoping / Preliminary Field Inspection (PFI)",null,null,null,null,"Public Hearing\nTeam Meeting",null,null,null,null,"Field Inspection\nMeeting",null,null,null,null,"Pre-Advertisement\nConference Meeting",null,null,null,null,"Advertisement"]
[null,"Level of Project Development (Design Only)",null,null,null,null,null,null,null,0.2,null,null,null,null,0.4,null,null,null,null,0.75,null,null,null,null,1]
[null,"PRELIMINARY ENGINEERING PHASE"]
[null,null,"Project Estimate Component"]
[null,null,"Discipline",null,"Defined ($)","Allowance",null,null,"Total","Defined ($)","Allowance",null,null,"Total","Defined ($)","Allowance",null,null,"Total","Defined ($)","Allowance",null,null,"Total","Defined ($)","Allowance",null,null,"Total"]
[null,null,"Project Management",null,null,null,null,null,null,null,null,null,null,null,null,null,null,null,null,null,null,null,null,null,null,null,null,null,null,"Expenditures"]
[null,null,"Roadway"]
[null,null,"Hydraulics"]
[null,null,"In-Plan Utilities"]
[null,null,"Traffic"]
[null,null,"Structures/Bridges"]
[null,null,"Materials/Geotech"]
[null,null,"Survey"]
[null,null,"Environmental"]
[null,null,"Right-of-Way"]
[null,null,"Other"]
[null,null,"VDOT PE Oversight on Local Assistance Projects"]
[null,null,"SUBTOTAL PE PHASE ESTIMATE",null,null,null,"Phase Risk Type Below",null,null,null,null,"- Phase Risk Type Below",null,null,null,null,"Phase Risk Type Below",null,null,null,null,"Phase Risk Type Below",null,null,null,null,"Phase Risk Type Below"]
[null,null,null,null,null,"Phase Contingency  (Value of Risk)",null,null,null,null,"Phase Contingency  (Value of Risk)",null,null,null,null,"Phase Contingency  (Value of Risk)",null,null,null,null,"Phase Contingency  (Value of Risk)",null,null,null,null,"Phase Contingency  (Value of Risk)"]
[null,null,"TOTAL PE PHASE ESTIMATE"]
[null,null,"PE Base Estimate Date (XX/XXXX)"]
[null,null,"PE Phase Start Date (XX/XX/XXXX)",null,null,null,null,"End Date",null,null,null,null,"End Date",null,null,null,null,"End Date",null,null,null,null,"End Date",null,null,null,null,"End Date"]
[null,"RIGHT OF WAY AND UTILITIES PHASE"]
[null,null,"Discipline",null,"Defined ($)","Allowance","Select Phase Risk Type Here (if using different contingency values for each discipline)","Contingency                                    (Value of Risk)","Total","Defined ($)","Allowance","Select Phase Risk Type Here (if using different contingency values for each discipline)",null,"Total","Defined ($)","Allowance","Select Phase Risk Type Here (if using different contingency values for each discipline)",null,"Total","Defined ($)","Allowance","Select Phase Risk Type Here (if using different contingency values for each discipline)",null,"Total","Defined ($)","Allowance","Select Phase Risk Type Here (if using different contingency values for each discipline)",{"$f":"IF(AA26=\"Type 1 Percentage\",\"Contingency  %                       (Value of Risk)\",IF(AA26=\"Type 2 Deterministic\",\"Contingency  $                       (Value of Risk)\",\"Contingency                                    (Value of Risk)\"))","v":"Contingency                                    (Value of Risk)"},"Total"]
[null,null,"Right-of-Way",null,null,null,null,null,null,null,null,null,null,null,null,null,null,null,null,null,null,null,null,null,null,null,null,null,null,"Expenditures"]
[" ",null,"Utilities"]
[null,null,"VDOT Project RW Oversight"]
[null,null,"VDOT RW/UT Oversight on Local Assistance Projects"]
{"$rows_left_out":44}
{"sheet":"Assumptions Tracking","index":3,"n_rows":39,"n_cols":6,"rows_kept":39,"cut":false,"hidden":false,"merged":[[0,0,0,5],[1,0,1,5],[21,1,21,5],[16,1,16,5]]}
["SYIP PROJECTS"]
["DOCUMENTATION OF ASSUMPTIONS AND CHANGE COMMENTS"]
[]
["Preliminary Engineering","Creation / Pre-scope (prior to project initiation)","Final Scoping / Preliminary Field Inspection (PFI)","Public Hearing Team Meeting","Field Inspection Meeting","Pre-advertisement Conference Team Meeting"]
["Project Management"]
["Roadway"]
["Hydraulics"]
["In-Plan Utilities"]
["Traffic"]
["Structures/Bridges"]
["Materials/Geotech"]
["Survey"]
["Environmental"]
["Right-of-Way"]
["Other"]
["VDOT PE Oversight on Local Assistance Projects"]
["Right-of-Way & Utilities"]
["Right-of-Way"]
["Utilities"]
["VDOT Project RW Oversight"]
["VDOT RW/UT Oversight on Local Assistance Projects"]
["Construction"]
["Mobilization/Constr. Support"]
["MOT"]
["Roadway"]
["Hydraulics"]
["In-plan Utilities"]
["Traffic"]
["Structures/Bridges"]
["Earthwork/Geotech"]
{"$rows_left_out":10}
{"sheet":"Inflation Summary & Upload","index":4,"n_rows":23,"n_cols":3,"rows_kept":23,"cut":false,"hidden":false,"merged":[[3,1,4,1],[3,2,4,2],[21,0,21,4],[22,0,22,4],[24,0,24,4],[17,0,17,4],[18,0,18,4],[19,0,19,4],[20,0,20,4]]}
[]
[]
[]
[null,"Inflation Factors","Future Cost (including inflation)"]
[]
[null,"Inflation**","Total Cost***"]
["PE Phase Estimate",{"$f":"IFERROR('Inflation Tables'!F4,1)","v":1},{"$f":"'Cost Estimate Summary'!F85*B7","v":0}]
["RW Phase Estimate ",{"$f":"IFERROR('Inflation Tables'!N4,1)","v":1},{"$f":"'Cost Estimate Summary'!F86*B8","v":0}]
["CN Phase Estimate(without CEI)",{"$f":"IFERROR('Inflation Tables'!X4,1)","v":1},{"$f":"'Cost Estimate Summary'!F87*B9","v":0}]
["Total CEI",{"$f":"IFERROR('Inflation Tables'!X4,1)","v":1},{"$f":"'Cost Estimate Summary'!F88*B10","v":0}]
["CN Phase Estimate(with CEI)",{"$f":"IFERROR('Inflation Tables'!X4,1)","v":1},{"$f":"'Cost Estimate Summary'!F89*B11","v":0}]
["Total Estimate","Total:",{"$f":"SUM(C7:C8)+C11","v":0}]
[]
[null,"** Inflation rates taken from VDOT Inflation/Escalation Memorandum, Dated 7/7/2023"]
[null,"*** Total Costs should match with total costs output from SMART Portal."]
[]
[]
["INSTRUCTIONS FOR TRANSFERING A CEWB ESTIMATE INTO A PCES(Workbook)"]
["1. Download the current version of the PCES workbook for your project from the PCES site and save to you computer (you do not need to open it yet) "]
["2. Click the \"Transfer CEWB to PCES\" button below."]
["3. After you click the button you will be prompted to open your PCES workbook.  After opening the workbook, the following will happen automatically:\n     a. The inflated PE, RW and CN estimate will be populated in the MANUAL tab, along with standard phase comments.\n     b. The PE, RW, Utility and CN phase will all be set to “Manual” on the SUMMARY tab.\n     c. The Ad Year and Construction End Year cells will be set to “FY2022” to avoid any inflation calculations in PCES.\n     d. The estimate shown in the SUMMARY tab should match the inflated estimate from your CEWB.\n"]
["4. Review the standard phase comments imported and adjust the comments in the \"MANUAL\" tab for specificity regarding your estimate."]
["5. Save the updated PCES workbook for upload to the PCES site."]

{"sheet":"Inflation Tables","index":5,"n_rows":114,"n_cols":24,"rows_kept":114,"cut":false,"hidden":true,"merged":[[6,24,7,24],[6,6,7,6],[1,0,1,4],[1,8,1,12],[2,16,2,17],[1,18,1,22],[6,14,7,14]]}
[]
["PE PHASE",null,null,null,null,null,null,null,"RW Phase",null,null,null,null,null,null,null,null,null,"CN Phase"]
["application fiscal year","region_code","FY for Phase Start ","Phase","Multiplier","PE Inflation Multiplier:",null,null,"application fiscal year","region_code","FY for Phase Start ","Phase","Multiplier","RW Inflation Multiplier:",null,null,null,null,"application fiscal year","region_code","FY for Phase Start ","Phase","Multiplier","CN Inflation Multiplier:"]
[2024,"V1P1",2024,"PE",1,{"$f":"INDEX(E4:E136, MATCH(1,  (F7=C4:C136) * (F8=D4:D136), 0))","v":{"$error":"#N/A"}},null,null,2024,"V1R5",2024,"RW",1,{"$f":"INDEX(M4:M128, MATCH(1,  (N7=K4:K128) * (N8=L4:L128), 0))","v":{"$error":"#N/A"}},null,null,null,null,2024,"V1C5",2024,"CN",1,{"$f":"INDEX(W4:W136, MATCH(1,  (X7=U4:U136) * (X8=V4:V136), 0))","v":{"$error":"#N/A"}}]
[2024,"V1P1",2025,"PE",1.05,null,null,null,2024,"V1R5",2025,"RW",1.05,null,null,null,null,null,2024,"V1C5",2025,"CN",1.05]
[2024,"V1P1",2026,"PE",1.1025,"Fiscal Year",null,null,2024,"V1R5",2026,"RW",1.1025,"Fiscal Year",null,null,null,null,2024,"V1C5",2026,"CN",1.1025,"Fiscal Year"]
[2024,"V1P1",2027,"PE",1.1576,{"$f":"YEAR('Cost Estimate Summary'!D28)+IF(MONTH('Cost Estimate Summary'!D28)>=7,1,0)","v":1900},null,null,2024,"V1R5",2027,"RW",1.1576,{"$f":"YEAR('Cost Estimate Summary'!D42)+IF(MONTH('Cost Estimate Summary'!D42)>=7,1,0)","v":1900},null,null,null,null,2024,"V1C5",2027,"CN",1.1576,{"$f":"YEAR('Cost Estimate Summary'!D77)+IF(MONTH('Cost Estimate Summary'!D77)>=7,1,0)","v":1900}]
[2024,"V1P1",2028,"PE",1.2155,{"$f":"IF('Cost Estimate Summary'!D28>1,\"PE\",\"\")","v":""},null,null,2024,"V1R5",2028,"RW",1.2155,{"$f":"IF('Cost Estimate Summary'!D42>1,\"RW\",\"\")","v":""},null,null,null,null,2024,"V1C5",2028,"CN",1.2155,{"$f":"IF('Cost Estimate Summary'!D77>1,\"CN\",\"\")","v":""}]
[2024,"V1P1",2029,"PE",1.2763,null,null,null,2024,"V1R5",2029,"RW",1.2763,null,null,null,null,null,2024,"V1C5",2029,"CN",1.2763]
[2024,"V1P1",2030,"PE",1.3401000000000001,null,null,null,2024,"V1R5",2030,"RW",1.3401000000000001,null,null,null,null,null,2024,"V1C5",2030,"CN",1.3401000000000001]
[2024,"V1P1",2031,"PE",1.3803000000000001,null,null,null,2024,"V1R5",2031,"RW",1.3803000000000001,null,null,null,null,null,2024,"V1C5",2031,"CN",1.3803000000000001]
[2024,"V1P1",2032,"PE",1.4217,null,null,null,2024,"V1R5",2032,"RW",1.4217,null,null,null,null,null,2024,"V1C5",2032,"CN",1.4217]
[2024,"V1P1",2033,"PE",1.4643999999999999,null,null,null,2024,"V1R5",2033,"RW",1.4643999999999999,null,null,null,null,null,2024,"V1C5",2033,"CN",1.4643999999999999]
[2024,"V1P1",2034,"PE",1.5083,null,null,null,2024,"V1R5",2034,"RW",1.5083,null,null,null,null,null,2024,"V1C5",2034,"CN",1.5083]
[]
[]
[]
[]
[]
[]
[]
[]
[]
[]
[null,null,"2021 Values","2022 Values","2023 Values"]
[null,2023,1.03,0]
[null,2024,1.0609,8.0000000000000071E-2]
[null,2025,1.092727,0.13400000000000012]
[null,2026,1.1254999999999999,0.19070000000000009]
[null,2027,1.1592740743000001,0.25023500000000021]
{"$rows_left_out":85}
{"sheet":"Sliding Scales","index":6,"n_rows":28,"n_cols":12,"rows_kept":28,"cut":false,"hidden":true,"merged":[[24,4,24,9],[13,3,13,8],[7,3,7,8],[1,3,1,8]]}
[]
[null,null,null,"MEDIAN CONTINGENCY RANGE (Non-Complex Projects)"]
[null,null,null,null,"Pre-Scoping","Scoping /PFI Meeting ±20%","Preliminary Design / Public Hearing Team Meeting ±40%","Detailed Design / Field Inspection Meeting ±75%","Final Design / PAC 100%"]
[null,null,null,"High",55,45,30,22,15]
[null,null,null,"MLE",35,30,20,15,8]
[null,null,null,"Low",23,20,15,10,5]
[]
[null,null,null,"Moderately Complex"]
[null,null,null,null,"Pre-Scoping","Scoping /PFI Meeting ±20%","Preliminary Design / Public Hearing Team Meeting ±40%","Detailed Design / Field Inspection Meeting ±75%","Final Design / PAC 100%"]
[null,null,null,"High",75,60,40,30,18]
[null,null,null,"MLE",50,40,30,20,10]
[null,null,null,"Low",30,25,20,12,7]
[]
[null,null,null,"Most Complex (Major)"]
[null,null,null,null,"Pre-Scoping","Scoping /PFI Meeting ±20%","Preliminary Design / Public Hearing Team Meeting ±40%","Detailed Design / Field Inspection Meeting ±75%","Final Design / PAC 100%"]
[null,null,null,"High",100,75,40,30,18]
[null,null,null,"MLE",60,50,30,20,10]
[null,null,null,"Low",40,33,20,12,7]
[]
[]
[]
[]
[]
[null,null,"VDOT Generated Charts from AASHTO Data"]
[null,"Select Project Classification",null,null,"AASHTO ORIGINAL CHARTS BELOW"]
[null,"Non-Complex (Minor)",null,null,null,null,null,null,null,null,"Moderately Complex",{"$f":"INDEX(pictures,MATCH('Cost Estimate Summary'!C7:D7,Projects,0))","v":{"$error":"#VALUE!"}}]
[null,"Moderately Complex"]
[null,"Most Complex (Major)"]